Target
Toll-like receptor 7
Ligand
BDBM50189291
Substrate
Meas. Tech.
Reporter Gene Assay
EC50
885±n/a nM
Citation
 Otten, GWu, TYWarren, TKBavari, S Benzonapthyridine compositions and uses thereof US Patent  US9597326 Publication Date 3/21/2017 
Target
Name:
Toll-like receptor 7
Synonyms:
ORF Names:UNQ248/PRO285 TLR7_HUMAN | Toll-like receptor 7 (TLR7)
Type:
Enzyme
Mol. Mass.:
120945.35
Organism:
Homo sapiens (Human)
Description:
Q9NYK1
Residue:
1049
  
Inhibitor
Name:
BDBM50189291
Synonyms:
CHEMBL3827959 | US9597326, Compound 14
Type:
Small organic molecule
Emp. Form.:
C23H22N3O5P
Mol. Mass.:
451.4116
SMILES:
COc1ccc(CCc2cnc3c(N)nc4cc(ccc4c3c2)C(=O)P(O)(O)=O)c(C)c1
: