Target
Adenosine receptor A1
Ligand
BDBM50382491
Substrate
Meas. Tech.
Binding Assay
Ki
0.145±n/a nM
Citation
 Congreve, MSAndrews, SPMason, JSRichardson, CMBrown, GA 1,2,4-triazine-4-amine derivatives US Patent  US10988455 Publication Date 4/27/2021 
Target
Name:
Adenosine receptor A1
Synonyms:
A1 adenosine receptor (hA1) AA1R_HUMAN ADORA1 Adenosine A1-receptor Adenosine receptor A1 (hA1) | Adenosine transporter (AdT)
Type:
G Protein-Coupled Receptor (GPCR)
Mol. Mass.:
36520.92
Organism:
Homo sapiens (Human)
Description:
P30542
Residue:
326
  
Inhibitor
Name:
BDBM50382491
Synonyms:
CHEMBL2024114 | US10988455, Example 1(xlii)
Type:
Small organic molecule
Emp. Form.:
C15H11ClN4O
Mol. Mass.:
298.727
SMILES:
Nc1nnc(-c2ccc(O)c(Cl)c2)c(n1)-c1ccccc1
: