Target
Tyrosine-protein kinase SYK
Ligand
BDBM301993
Substrate
Meas. Tech.
Homogeneous Time-Resolved Fluorescence (HTRF) Assay
IC50
0.103±n/a nM
Citation
 Altman, MDAndresen, BMArrington, KLChilders, KKDi Francesco, MEEllis, JMHaidle, AMLiu, YNorthrup, ABO Boyle, BOtte, RDReutershan, MHVitharana, DWoo, HC Thiazole-substituted aminopyridines as spleen tyrosine kinase inhibitors US Patent  US9598405 Publication Date 3/21/2017 
Target
Name:
Tyrosine-protein kinase SYK
Synonyms:
KSYK_HUMAN Spleen Tyrosine Kinase Tyrosine-protein kinase SYK (Syk)
Type:
Enzyme
Mol. Mass.:
72079.99
Organism:
Homo sapiens (Human)
Description:
P43405
Residue:
635
  
Inhibitor
Name:
BDBM301993
Synonyms:
BDBM301994 | US9598405, 1.1
Type:
Small Organic Molecule
Emp. Form.:
C26H30N4O3S
Mol. Mass.:
478.606
SMILES:
Cc1cc(Nc2cc(ccn2)C2CC2)nc(c1)-c1cnc(s1)[C@@]1(O)CC[C@H](C(O)=O)C(C)(C)C1
: