BDBM100436 US8501783, 1702
SMILES COC(=O)N1CCC(CC1)NC(=O)NC12CC3CC(CC(C3)C1)C2
InChI Key InChIKey=NGXJRSAITKOZAB-UHFFFAOYSA-N
Data  1 IC50
  Tab Delimited (TSV)   2D SDfile   Computed 3D by Vconf -m prep SDfile
Find this compound or compounds like it in BindingDB:
Activity Spreadsheet -- Enzyme Inhibition Constant Data from BindingDB
Found 1 hit for monomerid = 100436
TargetEpoxide hydrolase 1(Homo sapiens (Human))
The Regents Of The University Of California
US Patent
LigandPNGBDBM100436(US8501783, 1702)
Affinity DataIC50:  0.900nM. Assay description: Inhibition assay of human soluble epoxide hydrolases.
In DepthDetails US Patent