BDBM109897 US8609647, 41
SMILES CC1(C)CCN(C(=O)CC#N)C11CCN(C1)c1ncnc2[nH]ccc12
InChI Key InChIKey=IRKRUMKFBUIGLS-UHFFFAOYSA-N
Data  1 IC50
  Tab Delimited (TSV)   2D SDfile   Computed 3D by Vconf -m prep SDfile
Find this compound or compounds like it in BindingDB:
Activity Spreadsheet -- Enzyme Inhibition Constant Data from BindingDB
Found 1 hit for monomerid = 109897
TargetTyrosine-protein kinase JAK3(Homo sapiens (Human))
Japan Tobacco
US Patent
LigandPNGBDBM109897(US8609647, 41)
Affinity DataIC50:  90nM. Assay description: In the kinase reactions, fused proteins (6His tag-fused hJAK3 kinase domain (aa781-end)) which were coexpressed in Sf21 cells and purified by Ni2+/NT...
In DepthDetails US Patent