BDBM111453 N-(2-fluorophenyl)-4-methyl-3-(4-(pyridin-3-yl) pyrimidin-2-ylamino) benzamide (A6)
SMILES Cc1ccc(cc1Nc1nccc(n1)-c1cccnc1)C(=O)Nc1ccccc1F
InChI Key InChIKey=SJAYGIZUXPAYIE-UHFFFAOYSA-N
Data  1 IC50
  Tab Delimited (TSV)   2D SDfile   Computed 3D by Vconf -m prep SDfile
Find this compound or compounds like it in BindingDB:
Activity Spreadsheet -- Enzyme Inhibition Constant Data from BindingDB
Found 1 hit for monomerid = 111453
TargetBreakpoint cluster region protein [1-693](Homo sapiens (Human))
Xi'An Jiaotong University
LigandPNGBDBM111453(N-(2-fluorophenyl)-4-methyl-3-(4-(pyridin-3-yl) py...)
Affinity DataIC50:  569nM. Assay description: ATP (6.021 μM) and substrate (457.7 nM) were used. Kinase, substrate peptide, and inhibitor were added in a 384-well plate. The reaction was s...
In DepthDetails ArticlePubMed