BDBM11315 1,4-diamino-5,8-dihydroxy-9,10-dihydroanthracene-9,10-dione::1,4-diamino-5,8-dihydroxy-anthraquinone::DAA
SMILES Nc1ccc(N)c2C(=O)c3c(O)ccc(O)c3C(=O)c12
InChI Key InChIKey=QVEMRPAUHFWHRV-UHFFFAOYSA-N
Data  1 KI
PDB links: 1 PDB ID matches this monomer.
  Tab Delimited (TSV)   2D SDfile   Computed 3D by Vconf -m prep SDfile
Find this compound or compounds like it in BindingDB:
Activity Spreadsheet -- Enzyme Inhibition Constant Data from BindingDB
Found 1 hit for monomerid = 11315
TargetCasein kinase II subunit alpha(Zea mays (Maize))
University of Padova
LigandPNGBDBM11315(1,4-diamino-5,8-dihydroxy-9,10-dihydroanthracene-9...)
Affinity DataKi:  350nM ΔG°:  -8.71kcal/molepH: 7.5 T: 2°C. Assay description: In vitro kinase assay using purified enzyme, was incubated at room temperature with substrate, and test compounds in the presence of 100 uM ATP/ [gam...