BDBM11324 (2R,3R,4S,5R)-2-(5,6-dichloro-1H-1,3-benzodiazol-1-yl)-5-(hydroxymethyl)oxolane-3,4-diol::5,6-Dichloro-1-.beta.-D-ribofuranosylbenzimidazole::5,6-dichloro-ribofuranosylbenzimidazole::CHEMBL375530::DRB
SMILES OC[C@H]1O[C@H]([C@H](O)[C@@H]1O)n1cnc2cc(Cl)c(Cl)cc12
InChI Key InChIKey=XHSQDZXAVJRBMX-DDHJBXDOSA-N
Data  3 KI  1 IC50
PDB links: 3 PDB IDs match this monomer.
  Tab Delimited (TSV)   2D SDfile   Computed 3D by Vconf -m prep SDfile
Find this compound or compounds like it in BindingDB:
Activity Spreadsheet -- Enzyme Inhibition Constant Data from BindingDB
Found 4 hits for monomerid = 11324
TargetCyclin-T1/Cyclin-dependent kinase 9(Homo sapiens (Human))
University Of Oxford
Curated by ChEMBL
LigandPNGBDBM11324((2R,3R,4S,5R)-2-(5,6-dichloro-1H-1,3-benzodiazol-1...)
Affinity DataKi:  340nM. Assay description: Inhibition of CDK9/Cyclin T (1 to 330 amino acid residues) (unknown origin) by differential scanning fluorimetry assay
TargetCasein kinase II subunit alpha(Homo sapiens (Human))
University of Padova
LigandPNGBDBM11324((2R,3R,4S,5R)-2-(5,6-dichloro-1H-1,3-benzodiazol-1...)
Affinity DataKi:  4.50E+3nM ΔG°:  -7.22kcal/molepH: 7.5 T: 2°C. Assay description: In vitro kinase assay using purified enzyme, was incubated at room temperature with substrate, and test compounds in the presence of 100 uM ATP/ [gam...
TargetCyclin-A1/Cyclin-A2/Cyclin-dependent kinase 2(Homo sapiens (Human))
University Of Oxford
Curated by ChEMBL
LigandPNGBDBM11324((2R,3R,4S,5R)-2-(5,6-dichloro-1H-1,3-benzodiazol-1...)
Affinity DataKi:  6.50E+4nM. Assay description: Inhibition of CDK2/Cyclin A (174 to 432 amino acid residues) (unknown origin) by differential scanning fluorimetry assay
TargetCasein kinase II subunit alpha(Homo sapiens (Human))
University of Padova
LigandPNGBDBM11324((2R,3R,4S,5R)-2-(5,6-dichloro-1H-1,3-benzodiazol-1...)
Affinity DataIC50:  1.30E+4nM. Assay description: Inhibition of GST-fused human recombinant CK2alpha expressed in Escherichia coli HMS174 (DE3)