BDBM122465 US8729074, 4
SMILES Cc1ccn2c(cnc2c1)-c1cnc(Cl)c(NS(=O)(=O)c2ccc(F)cc2)c1
InChI Key InChIKey=AGXPZHGTABSWBG-UHFFFAOYSA-N
Data  1 KI  1 IC50
  Tab Delimited (TSV)   2D SDfile   Computed 3D by Vconf -m prep SDfile
Find this compound or compounds like it in BindingDB:
Activity Spreadsheet -- Enzyme Inhibition Constant Data from BindingDB
Found 1 hit for monomerid = 122465
LigandPNGBDBM122465(US8729074, 4)
Affinity DataKi:  19nM IC50:  13nM. Assay description: The PI3K AlphaScreen assay (PerkinElmer, Waltham, Mass.) measures the activity of a panel of four phosphoinositide 3-kinases: PI3Kα, PI3Kβ,...
In DepthDetails US Patent