BDBM1326 3-Aminopyridin-2(1H)-one analogue 46::5-ethyl-6-methyl-3-{[(4-nitro-1,3-benzoxazol-2-yl)methyl]amino}-1,2-dihydropyridin-2-one
SMILES CCc1cc(NCc2nc3c(cccc3o2)[N+]([O-])=O)c(=O)[nH]c1C
InChI Key InChIKey=LROBJZBSTFWEFX-UHFFFAOYSA-N
Data  1 IC50
  Tab Delimited (TSV)   2D SDfile   Computed 3D by Vconf -m prep SDfile
Find this compound or compounds like it in BindingDB:
Activity Spreadsheet -- Enzyme Inhibition Constant Data from BindingDB
Found 1 hit for monomerid = 1326
TargetGag-Pol polyprotein [588-1027]/[588-1147](Human immunodeficiency virus type 1)
Merck Research Laboratories
LigandPNGBDBM1326(3-Aminopyridin-2(1H)-one analogue 46 | 5-ethyl-6-m...)
Affinity DataIC50:  2.45E+4nM. Assay description: The IC50 of reverse transcriptase is the concentration that inhibits 50% of recombinant HIV-1 RT RNA-directed DNA polymerase activity in vitro.
In DepthDetails ArticlePubMed