BDBM134849 US8846698, 323
SMILES Cn1cc(C(=O)c2cncc(NC(=O)CCc3cccc(Cl)c3)c2)c2cncnc12
InChI Key InChIKey=NEFQHOWDIJMWCO-UHFFFAOYSA-N
Data  1 IC50
  Tab Delimited (TSV)   2D SDfile   Computed 3D by Vconf -m prep SDfile
Find this compound or compounds like it in BindingDB:
Activity Spreadsheet -- Enzyme Inhibition Constant Data from BindingDB
Found 1 hit for monomerid = 134849
TargetHigh affinity nerve growth factor receptor(Homo sapiens (Human))
Pfizer
US Patent
LigandPNGBDBM134849(US8846698, 323)
Affinity DataIC50:  3.10E+3nM. Assay description: Isolated TRK Enzyme assays use the HTRF KinEASE-TK kit (Cisbio Cat# 62TK0PEJ) with recombinant His-tagged cytoplasmic domains of each TRK receptor so...
In DepthDetails US Patent