BDBM149920 US8975415, RP201::US8975415, RP203::US9242973, RP203
SMILES CC#Cc1cncc(c1)-c1ccc2OC(Cc3ccccc3)C3(COC3)C3(COC(N)=N3)c2c1
InChI Key InChIKey=UZRCBYZWOAYXCE-UHFFFAOYSA-N
Data  4 KI  6 IC50
  Tab Delimited (TSV)   2D SDfile   Computed 3D by Vconf -m prep SDfile
Find this compound or compounds like it in BindingDB:
Activity Spreadsheet -- Enzyme Inhibition Constant Data from BindingDB
Found 6 hits for monomerid = 149920
TargetBeta-secretase 1(Homo sapiens (Human))
Comentis
US Patent
LigandPNGBDBM149920(US8975415, RP201 | US8975415, RP203 | US9242973, R...)
Affinity DataKi:  67.6nM ΔG°:  -9.77kcal/mole IC50:  109nMpH: 4.4 T: 2°C. Assay description: Test Example 1: Potency of test compounds were determined by measurement of their inhibition of BACE1 activity toward a fluorescent substrate. Experi...
In DepthDetails US Patent
TargetBeta-secretase 1(Homo sapiens (Human))
Comentis
US Patent
LigandPNGBDBM149920(US8975415, RP201 | US8975415, RP203 | US9242973, R...)
Affinity DataKi:  67.6nM IC50:  109nM. Assay description: Potency of test compounds were determined by measurement of their inhibition of BACE1 activity toward a fluorescent substrate. Experiments were perfo...
In DepthDetails US Patent
TargetBeta-secretase 1(Homo sapiens (Human))
Comentis
US Patent
LigandPNGBDBM149920(US8975415, RP201 | US8975415, RP203 | US9242973, R...)
Affinity DataKi:  71.1nM IC50:  113nM. Assay description: Potency of test compounds were determined by measurement of their inhibition of BACE1 activity toward a fluorescent substrate. Experiments were perfo...
In DepthDetails US Patent
TargetBeta-secretase 1(Homo sapiens (Human))
Comentis
US Patent
LigandPNGBDBM149920(US8975415, RP201 | US8975415, RP203 | US9242973, R...)
Affinity DataKi:  71.1nM ΔG°:  -9.74kcal/mole IC50:  113nMpH: 4.4 T: 2°C. Assay description: Test Example 1: Potency of test compounds were determined by measurement of their inhibition of BACE1 activity toward a fluorescent substrate. Experi...
In DepthDetails US Patent
TargetBeta-secretase 1(Homo sapiens (Human))
Comentis
US Patent
LigandPNGBDBM149920(US8975415, RP201 | US8975415, RP203 | US9242973, R...)
Affinity DataIC50:  8.70nMT: 2°C. Assay description: Test Example 3: The potency of compounds against BACE1 activity was determined in a cellular assay of Aβ production. Human SK-N-BE(2) neuroblas...
In DepthDetails US Patent
TargetBeta-secretase 1(Homo sapiens (Human))
Comentis
US Patent
LigandPNGBDBM149920(US8975415, RP201 | US8975415, RP203 | US9242973, R...)
Affinity DataIC50:  4.90nMT: 2°C. Assay description: Test Example 3: The potency of compounds against BACE1 activity was determined in a cellular assay of Aβ production. Human SK-N-BE(2) neuroblas...
In DepthDetails US Patent