BDBM155538 US9012461, 14::US9012461, 15
SMILES CNC(=O)Cc1ccccc1CCc1nc(Nc2ccc(cc2)N2CCNCC2)ncc1C(F)(F)F
InChI Key InChIKey=WXWQWJUPUSHHNW-UHFFFAOYSA-N
Data  4 IC50  2 Kd
  Tab Delimited (TSV)   2D SDfile   Computed 3D by Vconf -m prep SDfile
Find this compound or compounds like it in BindingDB:
Activity Spreadsheet -- Enzyme Inhibition Constant Data from BindingDB
Found 6 hits for monomerid = 155538
TargetFocal adhesion kinase 1(Homo sapiens (Human))
Cancer Therapeutics Crc
US Patent
LigandPNGBDBM155538(US9012461, 14 | US9012461, 15)
Affinity DataIC50:  21nMpH: 7.4Assay Description:A biotin labeled peptide is used as substrate (amino acid sequence: Biotin-Glu-Gly-Pro-Trp-Leu-Glu-Glu-Glu-Glu-Glu-Ala-Tyr-Gly-Trp-Met-Asp-Phe-NH2)1S...
In DepthDetails US Patent
TargetFocal adhesion kinase 1(Homo sapiens (Human))
Cancer Therapeutics Crc
US Patent
LigandPNGBDBM155538(US9012461, 14 | US9012461, 15)
Affinity DataIC50:  18nMpH: 7.4Assay Description:A biotin labeled peptide is used as substrate (amino acid sequence: Biotin-Glu-Gly-Pro-Trp-Leu-Glu-Glu-Glu-Glu-Glu-Ala-Tyr-Gly-Trp-Met-Asp-Phe-NH2)1S...
In DepthDetails US Patent
TargetFocal adhesion kinase 1(Homo sapiens (Human))
Cancer Therapeutics Crc
US Patent
LigandPNGBDBM155538(US9012461, 14 | US9012461, 15)
Affinity DataIC50:  37nMpH: 7.0Assay Description:Compounds of the invention may be tested for in vitro activity in the following assay: A biotin labeled peptide is used as substrate (amino acid sequ...
In DepthDetails US Patent
TargetFocal adhesion kinase 1(Homo sapiens (Human))
Cancer Therapeutics Crc
US Patent
LigandPNGBDBM155538(US9012461, 14 | US9012461, 15)
Affinity DataKd:  5nMpH: 7.4 T: 2°C. Assay description: Binding parameters of compounds were determined using a Biacore S51 sensor. An anti-GST antibody was immobilized onto a CM5 chip by primary amine-cou...
In DepthDetails US Patent
TargetFocal adhesion kinase 1(Homo sapiens (Human))
Cancer Therapeutics Crc
US Patent
LigandPNGBDBM155538(US9012461, 14 | US9012461, 15)
Affinity DataIC50:  101nMpH: 7.0Assay Description:Compounds of the invention may be tested for in vitro activity in the following assay: A biotin labeled peptide is used as substrate (amino acid sequ...
In DepthDetails US Patent
TargetFocal adhesion kinase 1(Homo sapiens (Human))
Cancer Therapeutics Crc
US Patent
LigandPNGBDBM155538(US9012461, 14 | US9012461, 15)
Affinity DataKd:  6.10nMpH: 7.4 T: 2°C. Assay description: Binding parameters of compounds were determined using a Biacore S51 sensor. An anti-GST antibody was immobilized onto a CM5 chip by primary amine-cou...
In DepthDetails US Patent