BDBM171364 US9085571, Table 1, Compound 12
SMILES CCCNC(=O)c1cc(OC)cc(c1)C(=O)N[C@@H](Cc1ccccc1)[C@H](O)CN(CC(C)C)S(=O)(=O)c1ccc(OC)cc1
InChI Key InChIKey=YQELEGFQEWFJSO-IOWSJCHKSA-N
Data  1 KI
  Tab Delimited (TSV)   2D SDfile   Computed 3D by Vconf -m prep SDfile
Find this compound or compounds like it in BindingDB:
Activity Spreadsheet -- Enzyme Inhibition Constant Data from BindingDB
Found 1 hit for monomerid = 171364
TargetProtease(Human immunodeficiency virus 1 (HIV-1))
Purdue Research Foundation
US Patent
LigandPNGBDBM171364(US9085571, Table 1, Compound 12)
Affinity DataKi:  50nM. Assay description: Without being bound by theory, it is suggested that the compounds described herein may exert their utility by the inhibition of proteases encoded by ...
In DepthDetails US Patent