BDBM17349 CHEMBL386758::tert-butyl N-[(2S,3S)-4-{[(1S)-1-{[(1S)-3-carbamoyl-1-{[(1S)-1-carbamoyl-2-phenylethyl]carbamoyl}propyl]carbamoyl}-2-phenylethyl]amino}-3-hydroxy-1-phenylbutan-2-yl]carbamate
SMILES CC(C)(C)OC(=O)N[C@@H](Cc1ccccc1)[C@@H](O)CN[C@@H](Cc1ccccc1)C(=O)N[C@@H](CCC(N)=O)C(=O)N[C@@H](Cc1ccccc1)C(N)=O
InChI Key InChIKey=SSPOMXWWHDMCTH-XDIGFQIYSA-N
Data  3 KI
PDB links: 2 PDB IDs match this monomer.
  Tab Delimited (TSV)   2D SDfile   Computed 3D by Vconf -m prep SDfile
Find this compound or compounds like it in BindingDB:
Activity Spreadsheet -- Enzyme Inhibition Constant Data from BindingDB
Found 3 hits for monomerid = 17349
TargetDimer of Gag-Pol polyprotein [501-599](Human immunodeficiency virus type 1)
Academy of Sciences of The Czech Republic
LigandPNGBDBM17349(CHEMBL386758 | tert-butyl N-[(2S,3S)-4-{[(1S)-1-{[...)
Affinity DataKi:  33nMpH: 4.7Assay Description:Inhibition constants were determined by a spectrophotometric assay with the chromogenic peptide substrate.
TargetGag-Pol polyprotein [489-587](Human immunodeficiency virus type 1)
Academy Of Sciences Of The Czech Republic
Curated by ChEMBL
LigandPNGBDBM17349(CHEMBL386758 | tert-butyl N-[(2S,3S)-4-{[(1S)-1-{[...)
Affinity DataKi:  33nM. Assay description: Inhibition of wild type HIV1 protease
TargetGag-Pol polyprotein [489-587](Human immunodeficiency virus type 1)
Academy Of Sciences Of The Czech Republic
Curated by ChEMBL
LigandPNGBDBM17349(CHEMBL386758 | tert-butyl N-[(2S,3S)-4-{[(1S)-1-{[...)
Affinity DataKi:  1.00E+3nM. Assay description: Inhibition of HIV1 protease I8 mutant