BDBM177922 US10307413, Compound 337::US10391089, Compound 166::US10980794, Cmpd No 166::US11591326, Compound C1::US9675614, 166
SMILES O[C@@H](CNC(=O)c1cc(NC2COC2)ncn1)CN1CCc2ccccc2C1
InChI Key InChIKey=ZKXZLIFRWWKZRY-KRWDZBQOSA-N
Data  20 IC50  1 Kd
PDB links: 3 PDB IDs match this monomer.
  Tab Delimited (TSV)   2D SDfile   Computed 3D by Vconf -m prep SDfile
Find this compound or compounds like it in BindingDB:
Activity Spreadsheet -- Enzyme Inhibition Constant Data from BindingDB
Found 21 hits for monomerid = 177922
TargetProtein arginine N-methyltransferase 5(Homo sapiens (Human))
Epizyme
US Patent
LigandPNGBDBM177922(US10307413, Compound 337 | US10391089, Compound 16...)
Affinity DataIC50: <100nM. Assay description: The assays were all performed in a buffer consisting of 20 mM Bicine (pH=7.6), 1 mM TCEP, 0.005% BSG, and 0.002% Tween20, prepared on the day of use....
TargetProtein arginine N-methyltransferase 5(Homo sapiens (Human))TBA
LigandPNGBDBM177922(US10307413, Compound 337 | US10391089, Compound 16...)
Affinity DataIC50:  22nM. Assay description: Inhibition of PRMT5 human PRMT5 using [3H]-SAM as substrate by radioactive methylation assay
TargetProtein arginine N-methyltransferase 5(Homo sapiens (Human))
Epizyme
US Patent
LigandPNGBDBM177922(US10307413, Compound 337 | US10391089, Compound 16...)
Affinity DataIC50: <100nM. Assay description: The assays were all performed in a buffer consisting of 20 mM Bicine (pH=7.6), 1 mM TCEP, 0.005% BSG, and 0.002% Tween20, prepared on the day of use....
TargetProtein arginine N-methyltransferase 5(Homo sapiens (Human))
Epizyme
US Patent
LigandPNGBDBM177922(US10307413, Compound 337 | US10391089, Compound 16...)
Affinity DataIC50: <100nM. Assay description: The assays were all performed in a buffer consisting of 20 mM Bicine (pH=7.6), 1 mM TCEP, 0.005% BSG, and 0.002% Tween20, prepared on the day of use....
TargetProtein arginine N-methyltransferase 5(Homo sapiens (Human))TBA
LigandPNGBDBM177922(US10307413, Compound 337 | US10391089, Compound 16...)
Affinity DataIC50:  22nM. Assay description: Inhibition of PRMT5 (unknown origin) using H4R3 as substrate by HTRF assay
TargetMethylosome protein 50/Protein arginine N-methyltransferase 5(Homo sapiens (Human))
Epizyme
US Patent
LigandPNGBDBM177922(US10307413, Compound 337 | US10391089, Compound 16...)
Affinity DataIC50: <100nM. Assay description: The assays were all performed in a buffer consisting of 20 mM Bicine (pH=7.6), 1 mM TCEP, 0.005% BSG, and 0.002% Tween20, prepared on the day of use....
TargetMethylosome protein 50/Protein arginine N-methyltransferase 5(Homo sapiens (Human))
Epizyme
US Patent
LigandPNGBDBM177922(US10307413, Compound 337 | US10391089, Compound 16...)
Affinity DataIC50:  47nM. Assay description: Inhibition of recombinant human N-terminal FLAG-tagged PRMT5 (2 to end residues) /human N-terminal His-tagged MEP50 (2 to end residues) expressed in ...
TargetMethylosome protein 50/Protein arginine N-methyltransferase 5(Homo sapiens (Human))
Epizyme
US Patent
LigandPNGBDBM177922(US10307413, Compound 337 | US10391089, Compound 16...)
Affinity DataIC50:  22nM. Assay description: Inhibition of human recombinant PRMT5/MEP50 expressed in 293-F cells using histone 4 peptide as substrate after 90 mins in presence of [3H]SAM by aut...
TargetMethylosome protein 50/Protein arginine N-methyltransferase 5(Homo sapiens (Human))
Epizyme
US Patent
LigandPNGBDBM177922(US10307413, Compound 337 | US10391089, Compound 16...)
Affinity DataIC50:  47nM. Assay description: Inhibition of recombinant human N-terminal FLAG-tagged PRMT5 (2 to end residues)/human N-terminal His-tagged MEP50 (2 to end residues) expressed in H...
TargetMethylosome protein 50/Protein arginine N-methyltransferase 5(Homo sapiens (Human))
Epizyme
US Patent
LigandPNGBDBM177922(US10307413, Compound 337 | US10391089, Compound 16...)
Affinity DataIC50:  47nM. Assay description: Inhibition of recombinant human N-terminal FLAG-tagged PRMT5 (2 to end residues)/human N-terminal His-tagged MEP50 (2 to end residues) expressed in H...
TargetProtein arginine N-methyltransferase 5(Homo sapiens (Human))
Epizyme
US Patent
LigandPNGBDBM177922(US10307413, Compound 337 | US10391089, Compound 16...)
Affinity DataIC50: <100nM. Assay description: The assays were all performed in a buffer consisting of 20 mM Bicine (pH=7.6), 1 mM TCEP, 0.005% BSG, and 0.002% Tween20, prepared on the day of use....
TargetMethylosome protein 50/Protein arginine N-methyltransferase 5(Homo sapiens (Human))
Epizyme
US Patent
LigandPNGBDBM177922(US10307413, Compound 337 | US10391089, Compound 16...)
Affinity DataIC50:  22nM. Assay description: Inhibition of human full length FLAG-tagged PRMT5/human His6-tagged MEP50 expressed in baculovirus-infected Sf9 cells assessed as reduction in tritiu...
TargetProtein arginine N-methyltransferase 5(Homo sapiens (Human))TBA
LigandPNGBDBM177922(US10307413, Compound 337 | US10391089, Compound 16...)
Affinity DataIC50:  9nM. Assay description: Inhibition of PRMT5 in human Z138 cells assessed as reduction in symmetrical dimethylation of arginine containing substrate using SmD3 as substrate i...
TargetMethylosome protein 50/Protein arginine N-methyltransferase 5(Homo sapiens (Human))
Epizyme
US Patent
LigandPNGBDBM177922(US10307413, Compound 337 | US10391089, Compound 16...)
Affinity DataIC50:  30nM. Assay description: Inhibition of human PRMT5/MEP50 assessed as reduction in methyltransferase activity using histone 4 peptide as substrate in presence of [3H]SAM incub...
TargetMethylosome protein 50/Protein arginine N-methyltransferase 5(Homo sapiens (Human))
Epizyme
US Patent
LigandPNGBDBM177922(US10307413, Compound 337 | US10391089, Compound 16...)
Affinity DataIC50: >1.00E+5nM. Assay description: Displacement of fluorophore-labeled RIOK1 from human PRMT5/WDR77 hetero octameric complex expressed in Sf9 cells by competition fluorescence polariza...
TargetProtein arginine N-methyltransferase 5(Homo sapiens (Human))TBA
LigandPNGBDBM177922(US10307413, Compound 337 | US10391089, Compound 16...)
Affinity DataIC50:  60nM. Assay description: Inhibition of human PRMT5 co-complexed with MEP50 in absence of MTA using biotin labelled histone H4 peptide (1 to15) as substrate assessed as inhibi...
TargetProtein arginine N-methyltransferase 5(Homo sapiens (Human))TBA
LigandPNGBDBM177922(US10307413, Compound 337 | US10391089, Compound 16...)
Affinity DataIC50:  110nM. Assay description: Inhibition of MTA-bound human PRMT5 co-complexed with MEP50 using biotin labelled histone H4 peptide (1 to 15) as substrate assessed as inhibition of...
TargetProtein arginine N-methyltransferase 5(Homo sapiens (Human))TBA
LigandPNGBDBM177922(US10307413, Compound 337 | US10391089, Compound 16...)
Affinity DataKd:  1.10E+4nM. Assay description: Binding affinity to MTA-bound human PRMT5 assessed as dissociation constant by SPR assay
TargetMethylosome protein 50/Protein arginine N-methyltransferase 5(Homo sapiens (Human))
Epizyme
US Patent
LigandPNGBDBM177922(US10307413, Compound 337 | US10391089, Compound 16...)
Affinity DataIC50:  85nM. Assay description: General Procedure for PRMT5/MEP50 AlphaLISA Enzyme Inhibitory Assays: Assays were performed in the buffer consisting of 50 mM Tris, pH 8.5, 5 mM MgCl...
TargetProtein arginine N-methyltransferase 5(Homo sapiens (Human))TBA
LigandPNGBDBM177922(US10307413, Compound 337 | US10391089, Compound 16...)
Affinity DataIC50:  22nM. Assay description: Inhibition of PRMT5 (unknown origin) by biochemical assay
TargetMethylosome protein 50/Protein arginine N-methyltransferase 5(Homo sapiens (Human))
Epizyme
US Patent
LigandPNGBDBM177922(US10307413, Compound 337 | US10391089, Compound 16...)
Affinity DataIC50:  22nM. Assay description: Inhibition of full length recombinant human FLAG-tagged PRMT5/full length recombinant human His6-tagged MEP50 expressed in baculovirus infected Sf9 i...