BDBM182553 US9145392, 254::US9145392, 258
SMILES Nc1ncnc(N2CCC(CC2)c2nc(cn2CCN2CCCC2)-c2ccc(c(F)c2)C(F)(F)F)c1C1CCC1
InChI Key InChIKey=WLLLTIDXGZYUPF-UHFFFAOYSA-N
Data  4 IC50
  Tab Delimited (TSV)   2D SDfile   Computed 3D by Vconf -m prep SDfile
Find this compound or compounds like it in BindingDB:
Activity Spreadsheet -- Enzyme Inhibition Constant Data from BindingDB
Found 4 hits for monomerid = 182553
TargetRibosomal protein S6 kinase beta-1(Homo sapiens (Human))
Merck Patent
US Patent
LigandPNGBDBM182553(US9145392, 254 | US9145392, 258)
Affinity DataIC50:  8.10nMpH: 7.5 T: 2°C. Assay description: P70S6K inhibitor compounds are diluted and plated in 96 well plates. A reaction mixture including the following components is then added to the compo...
In DepthDetails US Patent
TargetRAC-alpha serine/threonine-protein kinase(Homo sapiens (Human))
Merck Patent
US Patent
LigandPNGBDBM182553(US9145392, 254 | US9145392, 258)
Affinity DataIC50:  380nMpH: 7.5Assay Description:A TTP Mosquito liquid handling instrument is used to place 125n1 of the appropriate concentration of inhibitor in 100% DMSO (for a dose response curv...
In DepthDetails US Patent
TargetRAC-alpha serine/threonine-protein kinase(Homo sapiens (Human))
Merck Patent
US Patent
LigandPNGBDBM182553(US9145392, 254 | US9145392, 258)
Affinity DataIC50:  9.10nMpH: 7.5Assay Description:A TTP Mosquito liquid handling instrument is used to place 125n1 of the appropriate concentration of inhibitor in 100% DMSO (for a dose response curv...
In DepthDetails US Patent
TargetRibosomal protein S6 kinase beta-1(Homo sapiens (Human))
Merck Patent
US Patent
LigandPNGBDBM182553(US9145392, 254 | US9145392, 258)
Affinity DataIC50:  36nMpH: 7.5 T: 2°C. Assay description: P70S6K inhibitor compounds are diluted and plated in 96 well plates. A reaction mixture including the following components is then added to the compo...
In DepthDetails US Patent