BDBM191919 US9187429, 58::US9187429, 59
SMILES CCC(=O)NC1CCc2c1cncc2-c1ccc(F)c(C)c1
InChI Key InChIKey=SKXSMQSYKQJTMU-UHFFFAOYSA-N
Data  2 EC50
  Tab Delimited (TSV)   2D SDfile   Computed 3D by Vconf -m prep SDfile
Find this compound or compounds like it in BindingDB:
Activity Spreadsheet -- Enzyme Inhibition Constant Data from BindingDB
Found 2 hits for monomerid = 191919
TargetCytochrome P450 11B2, mitochondrial(Homo sapiens (Human))
Hoffmann-La Roche
US Patent
LigandPNGBDBM191919(US9187429, 58 | US9187429, 59)
Affinity DataEC50:  10nM. Assay description: G-402 cells can be obtained from ATCC(CRL-1440) and were originally derived from a renal leiomyoblastoma. The expression plasmids contains the ORF ...
In DepthDetails US Patent
TargetCytochrome P450 11B1, mitochondrial(Homo sapiens (Human))
Hoffmann-La Roche
US Patent
LigandPNGBDBM191919(US9187429, 58 | US9187429, 59)
Affinity DataEC50:  156nM. Assay description: G-402 cells can be obtained from ATCC(CRL-1440) and were originally derived from a renal leiomyoblastoma. The expression plasmids contains the ORF ...
In DepthDetails US Patent