BDBM202618 US9242943, 27
SMILES C[C@]1(COCC(N)=N1)c1cc(Nc2cc(Cl)cc3cc(Cl)cnc23)ccc1F
InChI Key InChIKey=LBDVFEXBWOROJV-FQEVSTJZSA-N
Data  5 IC50
  Tab Delimited (TSV)   2D SDfile   Computed 3D by Vconf -m prep SDfile
Find this compound or compounds like it in BindingDB:
Activity Spreadsheet -- Enzyme Inhibition Constant Data from BindingDB
Found 5 hits for monomerid = 202618
TargetBeta-secretase 1(Homo sapiens (Human))
Siena Biotech
US Patent
LigandPNGBDBM202618(US9242943, 27)
Affinity DataIC50:  660nM. Assay description: DNA of the human APP wt gene (APP695) were used to assess the potency of the compounds in a cellular assay. The cells were seeded in 96-well microtit...
Ligand InfoPC cidPC sid
In DepthDetails US Patent
TargetBeta-secretase 2(Homo sapiens (Human))
Siena Biotech
US Patent
LigandPNGBDBM202618(US9242943, 27)
Affinity DataIC50:  558nM. Assay description: The assay uses the principle of inhibition of human TMEM27 cleavage by endogenous cellular BACE2 in the Ins1e rat cell line and shedding from the cel...
Ligand InfoPC cidPC sid
In DepthDetails US Patent
TargetCytochrome P450 2C9(Homo sapiens (Human))
Siena Biotech
US Patent
LigandPNGBDBM202618(US9242943, 27)
Affinity DataIC50: >5.00E+4nMT: 2°C. Assay description: Inhibition of cytochromes P450 (CYPs) 2C9, 2D6 and 3A4 was assessed using human liver microsomes and CYP-selective substrate metabolism reactions. ...
Ligand InfoPC cidPC sid
In DepthDetails US Patent
TargetCytochrome P450 2D6(Homo sapiens (Human))
Siena Biotech
US Patent
LigandPNGBDBM202618(US9242943, 27)
Affinity DataIC50:  4.50E+3nMT: 2°C. Assay description: Inhibition of cytochromes P450 (CYPs) 2C9, 2D6 and 3A4 was assessed using human liver microsomes and CYP-selective substrate metabolism reactions. ...
Ligand InfoPC cidPC sid
In DepthDetails US Patent
TargetCytochrome P450 3A4(Homo sapiens (Human))
Siena Biotech
US Patent
LigandPNGBDBM202618(US9242943, 27)
Affinity DataIC50:  3.30E+4nMT: 2°C. Assay description: Inhibition of cytochromes P450 (CYPs) 2C9, 2D6 and 3A4 was assessed using human liver microsomes and CYP-selective substrate metabolism reactions. ...
Ligand InfoPC cidPC sid
In DepthDetails US Patent