BDBM202644 US9242957, 8
SMILES N=C(Nc1ccc(CNCCc2cccc(NC(=N)c3cccs3)c2)cc1)c1cccs1
InChI Key InChIKey=QOYIQCDILLWFQP-UHFFFAOYSA-N
Data  3 KI
  Tab Delimited (TSV)   2D SDfile   Computed 3D by Vconf -m prep SDfile
Find this compound or compounds like it in BindingDB:
Activity Spreadsheet -- Enzyme Inhibition Constant Data from BindingDB
Found 3 hits for monomerid = 202644
TargetNitric oxide synthase, brain(Rattus norvegicus (rat))
Northwestern University
US Patent
LigandPNGBDBM202644(US9242957, 8)
Affinity DataKi:  5nM. Assay description: The compounds were evaluated for in vitro inhibition against three NOS isozymes: rat nNOS, bovine eNOS and marine iNOS using known literature methods...
Ligand InfoPC cidPC sid
In DepthDetails US Patent
TargetNitric oxide synthase, inducible(Mus musculus (mouse))
Northwestern University
US Patent
LigandPNGBDBM202644(US9242957, 8)
Affinity DataKi:  1.70E+3nM. Assay description: The compounds were evaluated for in vitro inhibition against three NOS isozymes: rat nNOS, bovine eNOS and marine iNOS using known literature methods...
Ligand InfoPC cidPC sid
In DepthDetails US Patent
TargetNitric oxide synthase, endothelial(Bos taurus (bovine))
Northwestern University
US Patent
LigandPNGBDBM202644(US9242957, 8)
Affinity DataKi:  2.70E+3nM. Assay description: The compounds were evaluated for in vitro inhibition against three NOS isozymes: rat nNOS, bovine eNOS and marine iNOS using known literature methods...
Ligand InfoPC cidPC sid
In DepthDetails US Patent