BDBM20312 (2R)-2-[(4-tert-butylphenyl)methyl]-3-[(2R)-2-(3-fluoro-4-methanesulfonamidophenyl)propanamido]propyl 2,2-dimethylpropanoate::4-t-butylbenzyl analogue, 71
SMILES C[C@@H](C(=O)NC[C@H](COC(=O)C(C)(C)C)Cc1ccc(cc1)C(C)(C)C)c1ccc(NS(C)(=O)=O)c(F)c1
InChI Key InChIKey=VUJKAHHLCSGVDB-TZIWHRDSSA-N
Data  1 KI  1 EC50
  Tab Delimited (TSV)   2D SDfile   Computed 3D by Vconf -m prep SDfile
Find this compound or compounds like it in BindingDB:
Activity Spreadsheet -- Enzyme Inhibition Constant Data from BindingDB
Found 1 hit for monomerid = 20312
TargetTransient receptor potential cation channel subfamily V member 1(Rattus norvegicus (rat))
Seoul National University
LigandPNGBDBM20312((2R)-2-[(4-tert-butylphenyl)methyl]-3-[(2R)-2-(3-f...)
Affinity DataKi:  53nM ΔG°:  -10.3kcal/mole EC50:  30.3nMpH: 7.4 T: 2°C. Assay description: Binding assay mixtures were set up and contained [3H] RTX, various concentrations of competing ligands, and rVR1-transfected CHO cells. Nonspecific b...
In DepthDetails ArticlePubMed