BDBM206475 US9260425, 223
SMILES CN1CCN(CC1=O)c1cc2c(n[nH]c2cn1)-c1cccc(n1)N1CCNCC1
InChI Key InChIKey=WPAGZAPRFWIYJS-UHFFFAOYSA-N
Data  1 KI
PDB links: 1 PDB ID matches this monomer.
  Tab Delimited (TSV)   2D SDfile   Computed 3D by Vconf -m prep SDfile
Find this compound or compounds like it in BindingDB:
Activity Spreadsheet -- Enzyme Inhibition Constant Data from BindingDB
Found 1 hit for monomerid = 206475
TargetSerine/threonine-protein kinase pim-1(Homo sapiens (Human))
Genetech
US Patent
LigandPNGBDBM206475(US9260425, 223)
Affinity DataKi:  38.5nMpH: 7.2Assay Description:PIM-1, PIM-2, and PIM-3 enzymes were generated as fusion proteins expressed in bacteria and purified by IMAC column chromatography (Sun, X., Chiu, J....
Ligand InfoPC cidPC sidPDB
In DepthDetails US Patent