BDBM223996 N-{4-[4-(4,7,10,13,16-Pentaoxanonadec-18-ynamido)benzoyl]-phenyl}-N’-[(4-sulfamoylphenyl)methyl]pentanediamide (3)
SMILES NS(=O)(=O)c1ccc(CNC(=O)CCCC(=O)Nc2ccc(cc2)C(=O)c2ccc(NC(=O)CCOCCOCCOCCOCCOCC#C)cc2)cc1
InChI Key InChIKey=FHUUSAUBJFXYMX-UHFFFAOYSA-N
Data  1 IC50
  Tab Delimited (TSV)   2D SDfile   Computed 3D by Vconf -m prep SDfile
Find this compound or compounds like it in BindingDB:
Activity Spreadsheet -- Enzyme Inhibition Constant Data from BindingDB
Found 1 hit for monomerid = 223996
TargetCarbonic anhydrase 2(Homo sapiens (Human))
Griffith University
LigandPNGBDBM223996(N-{4-[4-(4,7,10,13,16-Pentaoxanonadec-18-ynamido)b...)
Affinity DataIC50:  1.22E+3nMpH: 7.0 T: 2°C. Assay description: The assay was performed according to a previously reported protocol.[Banerjee et al., Biochemistry, 44:3673-3682] DNSA stock solution was prepared at...
Ligand InfoPC cidPC sid
In DepthDetails ArticlePubMed