BDBM230852 US9346793, 3
SMILES CC(C)(O)c1coc(Cn2ncc(NC(=O)c3ncoc3-c3ccccc3)n2)n1
InChI Key InChIKey=NRHWULLOWPGZHO-UHFFFAOYSA-N
Data  1 EC50
  Tab Delimited (TSV)   2D SDfile   Computed 3D by Vconf -m prep SDfile
Find this compound or compounds like it in BindingDB:
Activity Spreadsheet -- Enzyme Inhibition Constant Data from BindingDB
Found 1 hit for monomerid = 230852
TargetGuanine nucleotide-binding protein subunit alpha-15 [Y147C]/N-formyl peptide receptor 2(Homo sapiens (Human))
Actelion Pharmaceuticals
US Patent
LigandPNGBDBM230852(US9346793, 3)
Affinity DataEC50:  8nM. Assay description: Cells expressing recombinant human ALX receptor and the G-protein Gα16 (HEK293-hALXR-Gα16) were grown to 80% confluency in Growing Medium (...
Ligand InfoPC cidPC sid
In DepthDetails US Patent