BDBM24239 1-{[4-(1,3-benzothiazol-2-yloxy)phenyl]methyl}piperidine-4-carboxylic acid::Benzthiazole compound, 33r
SMILES OC(=O)C1CCN(Cc2ccc(Oc3nc4ccccc4s3)cc2)CC1
InChI Key InChIKey=BUZBVOKDNAZIIM-UHFFFAOYSA-N
Data  3 IC50
PDB links: 1 PDB ID matches this monomer.
  Tab Delimited (TSV)   2D SDfile   Computed 3D by Vconf -m prep SDfile
Find this compound or compounds like it in BindingDB:
Activity Spreadsheet -- Enzyme Inhibition Constant Data from BindingDB
Found 3 hits for monomerid = 24239
TargetLeukotriene A-4 hydrolase(Homo sapiens (Human))
Johnson & Johnson Pharmaceutical
LigandPNGBDBM24239(1-{[4-(1,3-benzothiazol-2-yloxy)phenyl]methyl}pipe...)
Affinity DataIC50:  11nMT: 2°C. Assay description: Recombinant human LTA4H was incubated with various concentrations of test compound for 10 min at room temperature in assay buffer, and the substrate,...
TargetPotassium voltage-gated channel subfamily H member 2(Homo sapiens (Human))
Janssen Research And Development
Curated by ChEMBL
LigandPNGBDBM24239(1-{[4-(1,3-benzothiazol-2-yloxy)phenyl]methyl}pipe...)
Affinity DataIC50: >1.00E+4nM. Assay description: Inhibition of dofetilide binding to human ERG by patch clamp assay
In DepthDetails ArticlePubMed
TargetPotassium voltage-gated channel subfamily H member 2(Homo sapiens (Human))
Janssen Research And Development
Curated by ChEMBL
LigandPNGBDBM24239(1-{[4-(1,3-benzothiazol-2-yloxy)phenyl]methyl}pipe...)
Affinity DataIC50: >3.00E+4nM. Assay description: Compounds were assessed for their ability to displace [3H]astemizole using membranes from HEK-293 cells expressing the hERG K+ channel.
In DepthDetails ArticlePubMed