BDBM24304 Letrozole derivative, 28::{4-[(4-cyanophenyl)(1H-1,2,4-triazol-1-yl)methyl]phenyl} sulfamate
SMILES NS(=O)(=O)Oc1ccc(cc1)C(c1ccc(cc1)C#N)n1cncn1
InChI Key InChIKey=UXGGCNNPHVIMSO-UHFFFAOYSA-N
Data  1 IC50  1 Other
  Tab Delimited (TSV)   2D SDfile   Computed 3D by Vconf -m prep SDfile
Find this compound or compounds like it in BindingDB:
Activity Spreadsheet -- Enzyme Inhibition Constant Data from BindingDB
Found 2 hits for monomerid = 24304
TargetAromatase(Homo sapiens (Human))
University of Bath
LigandPNGBDBM24304(Letrozole derivative, 28 | {4-[(4-cyanophenyl)(1H-...)
Affinity DataIC50:  13nMpH: 7.5 T: 2°C. Assay description: The extent of in vitro inhibition of aromatase activities was assessed using intact monolayers of JEG-3 cells. Aromatase activity was measured using ...
In DepthDetails ArticlePubMed
TargetSteryl-sulfatase(Homo sapiens (Human))
University of Bath
LigandPNGBDBM24304(Letrozole derivative, 28 | {4-[(4-cyanophenyl)(1H-...)
Affinity DatapH: 7.5 T: 2°C. Assay description: The extent of in vitro inhibition of sulfatase activities was assessed using intact monolayers of JEG-3 cells. Sulfatase activity was measured using ...
In DepthDetails ArticlePubMed