BDBM260691 US9533989, 1
SMILES N[C@H]1CCCC[C@H]1Nc1nc(Nc2cccc3[nH]ccc23)c2c(cc[nH]c2=O)n1
InChI Key InChIKey=OICBAWBRBZDHRS-XJKSGUPXSA-N
Data  1 IC50
  Tab Delimited (TSV)   2D SDfile   Computed 3D by Vconf -m prep SDfile
Find this compound or compounds like it in BindingDB:
Activity Spreadsheet -- Enzyme Inhibition Constant Data from BindingDB
Found 1 hit for monomerid = 260691
TargetTyrosine-protein kinase SYK(Homo sapiens (Human))
Ziarco Pharma
US Patent
LigandPNGBDBM260691(US9533989, 1)
Affinity DataIC50:  0.809nM. Assay description: The Promega ADP-Glo Kinase Assay is a luminescent ADP detection assay that provides a universal, homogeneous, high-throughput screening method to mea...
Ligand InfoPC cidPC sid
In DepthDetails US Patent