BDBM263015 US9708337, 29::methyl 4-((5H-chromeno[3,4-c]pyridin-8-yl)amino)-4-oxobutanoate
SMILES COC(=O)CCC(=O)Nc1ccc-2c(OCc3cnccc-23)c1
InChI Key InChIKey=XXWFKTMKZJHIGH-UHFFFAOYSA-N
Data  1 IC50
  Tab Delimited (TSV)   2D SDfile   Computed 3D by Vconf -m prep SDfile
Find this compound or compounds like it in BindingDB:
Activity Spreadsheet -- Enzyme Inhibition Constant Data from BindingDB
Found 1 hit for monomerid = 263015
TargetAP2-associated protein kinase 1(Homo sapiens (Human))
Bristol-Myers Squibb
US Patent
LigandPNGBDBM263015(US9708337, 29 | methyl 4-((5H-chromeno[3,4-c]pyrid...)
Affinity DataIC50:  652nMpH: 7.4 T: 2°C. Assay description: The assays were performed in U-bottom 384-well plates. The final assay volume was 30 μl prepared from 15 μl additions of enzyme and substra...
Ligand InfoPC cidPC sid
In DepthDetails US Patent