BDBM26480 2-[7-methoxy-2-oxo-4-(trifluoromethyl)-2H-chromen-3-yl]acetic acid::7-methoxy-4-trifluoromethylcoumarin-3-acetic acid
SMILES COc1ccc2c(c(CC(O)=O)c(=O)oc2c1)C(F)(F)F
InChI Key InChIKey=JZIMGKLVQCYNHJ-UHFFFAOYSA-N
Data  2 IC50
  Tab Delimited (TSV)   2D SDfile   Computed 3D by Vconf -m prep SDfile
Find this compound or compounds like it in BindingDB:
Activity Spreadsheet -- Enzyme Inhibition Constant Data from BindingDB
Found 2 hits for monomerid = 26480
TargetCytochrome P450 2C9(Homo sapiens (Human))
Glaxosmithkline
Curated by ChEMBL
LigandPNGBDBM26480(2-[7-methoxy-2-oxo-4-(trifluoromethyl)-2H-chromen-...)
Affinity DataIC50:  5.00E+4nM. Assay description: Inhibition of human CYP2C9
In DepthDetails ArticlePubMed
TargetCytochrome P450 2C9(Homo sapiens (Human))
Glaxosmithkline
Curated by ChEMBL
LigandPNGBDBM26480(2-[7-methoxy-2-oxo-4-(trifluoromethyl)-2H-chromen-...)
Affinity DataIC50:  5.00E+4nM. Assay description: Inhibition of human CYP2C9
In DepthDetails ArticlePubMed