BDBM267600 4-(8-amino-3-((cis)-1-(cyclopropanecarbonyl)-6-methylpiperidin-3-yl)imidazo[1,5-a]pyrazin-1-yl)-N-(pyridin-2-yl)benzamide::US9718828, Example, 193
SMILES CCNC(=O)N1C[C@@H](CC[C@@H]1C)c1nc(-c2ccc(cc2)C(=O)Nc2ccccn2)c2c(N)nccn12
InChI Key InChIKey=ZYOMEAXTMWJSQR-FXAWDEMLSA-N
Data  1 EC50
  Tab Delimited (TSV)   2D SDfile   Computed 3D by Vconf -m prep SDfile
Find this compound or compounds like it in BindingDB:
Activity Spreadsheet -- Enzyme Inhibition Constant Data from BindingDB
Found 1 hit for monomerid = 267600
TargetTyrosine-protein kinase BTK(Homo sapiens (Human))
Merck Sharp & Dohme
US Patent
LigandPNGBDBM267600(4-(8-amino-3-((cis)-1-(cyclopropanecarbonyl)-6-met...)
Affinity DataEC50: <10nMpH: 7.2 T: 2°C. Assay description: Btk enzyme activity is measured using the IMAP (immobilized metal ion affinity-based fluorescence polarization) assay as outlined below. Btk enzyme (...
Ligand InfoPC cidPC sid
In DepthDetails US Patent