BDBM27151 2-(1-cyclobutyl-2-methylpyrrolidin-2-yl)-1H-1,3-benzodiazole-4-carboxamide::benzimidazole carboxamide, 16
SMILES CC1(CCCN1C1CCC1)c1nc2cccc(C(N)=O)c2[nH]1
InChI Key InChIKey=IGZLGFQFXDRWON-UHFFFAOYSA-N
Data  1 KI
  Tab Delimited (TSV)   2D SDfile   Computed 3D by Vconf -m prep SDfile
Find this compound or compounds like it in BindingDB:
Activity Spreadsheet -- Enzyme Inhibition Constant Data from BindingDB
Found 1 hit for monomerid = 27151
TargetPoly [ADP-ribose] polymerase 1(Homo sapiens (Human))
Abbott Laboratories
LigandPNGBDBM27151(2-(1-cyclobutyl-2-methylpyrrolidin-2-yl)-1H-1,3-be...)
Affinity DataKi:  31nM ΔG°:  -10.1kcal/molepH: 8.0 T: 2°C. Assay description: PARP assays utilizing SPA bead-based detection were carried out in 96-well plates. After reaction was terminated, the reaction mixtures were transfer...
In DepthDetails ArticlePubMed