BDBM291812 N-((5-fluoro-2,3-dihydrobenzofuran-4-yl)methyl)-8-(4-methyl-6-(methylsulfonyl)pyridin-3-yl)-[1,2,4]triazolo[4,3-c]pyrimidin-5-amine::US11207325, Example 127::US9580437, Example 127
SMILES Cc1cc(ncc1-c1cnc(NCc2c3CCOc3ccc2F)n2cnnc12)S(C)(=O)=O
InChI Key InChIKey=GUCRIBUTILKTSS-UHFFFAOYSA-N
Data  6 IC50
  Tab Delimited (TSV)   2D SDfile   Computed 3D by Vconf -m prep SDfile
Find this compound or compounds like it in BindingDB:
Activity Spreadsheet -- Enzyme Inhibition Constant Data from BindingDB
Found 6 hits for monomerid = 291812
LigandPNGBDBM291812(N-((5-fluoro-2,3-dihydrobenzofuran-4-yl)methyl)-8-...)
Affinity DataIC50:  2.60nMpH: 8.0Assay Description:To assess the compounds potency in the EED-H3K27Me3 competition binding assay, compounds were serially diluted 3-fold in DMSO to obtain a total of tw...
Ligand InfoPC cidPC sid
In DepthDetails US Patent
LigandPNGBDBM291812(N-((5-fluoro-2,3-dihydrobenzofuran-4-yl)methyl)-8-...)
Affinity DataIC50:  8.80nMpH: 8.0Assay Description:Representative compounds of the present disclosure were serially and separately diluted 3-fold in DMSO to obtain a total of eight or twelve concentra...
Ligand InfoPC cidPC sid
In DepthDetails US Patent
TargetPolycomb protein EED(Homo sapiens (Human))
Novartis
US Patent
LigandPNGBDBM291812(N-((5-fluoro-2,3-dihydrobenzofuran-4-yl)methyl)-8-...)
Affinity DataIC50:  28nM. Assay description: Representative compounds of the present disclosure were serially and separately diluted 3-fold in DMSO to obtain a total of eight or twelve concentra...
Ligand InfoPC cidPC sid
In DepthDetails US Patent
TargetPolycomb protein EED(Homo sapiens (Human))
Novartis
US Patent
LigandPNGBDBM291812(N-((5-fluoro-2,3-dihydrobenzofuran-4-yl)methyl)-8-...)
Affinity DataIC50:  2.60nM. Assay description: To assess the compounds potency in the EED-H3K27Me3 competition binding assay, compounds were serially diluted 3-fold in DMSO to obtain a total of tw...
Ligand InfoPC cidPC sid
In DepthDetails US Patent
TargetPolycomb protein EED(Homo sapiens (Human))
Novartis
US Patent
LigandPNGBDBM291812(N-((5-fluoro-2,3-dihydrobenzofuran-4-yl)methyl)-8-...)
Affinity DataIC50:  8.80nM. Assay description: Representative compounds of the present disclosure were serially and separately diluted 3-fold in DMSO to obtain a total of eight or twelve concentra...
Ligand InfoPC cidPC sid
In DepthDetails US Patent
LigandPNGBDBM291812(N-((5-fluoro-2,3-dihydrobenzofuran-4-yl)methyl)-8-...)
Affinity DataIC50:  28nM. Assay description: Cell lysates were transferred to the wells of a 384-well plate and the final volume was adjusted to 50 μL per well with PBS. The plate was seale...
Ligand InfoPC cidPC sid
In DepthDetails US Patent