BDBM294312 US9586948, Example 31
SMILES Cn1cc(NC(=O)c2cccc(n2)-c2cnccc2Cl)c(n1)C(N)=O
InChI Key InChIKey=XVZKDSRWPNHHRA-UHFFFAOYSA-N
Data  3 IC50
  Tab Delimited (TSV)   2D SDfile   Computed 3D by Vconf -m prep SDfile
Find this compound or compounds like it in BindingDB:
Activity Spreadsheet -- Enzyme Inhibition Constant Data from BindingDB
Found 2 hits for monomerid = 294312
TargetInterleukin-1 receptor-associated kinase 4(Homo sapiens (Human))
Merck Research Laboratories
Curated by ChEMBL
LigandPNGBDBM294312(US9586948, Example 31)
Affinity DataIC50:  683nM. Assay description: Inhibition of human recombinant N-terminal GST-tagged full-length IRAK4 expressed in baculovirus infected Sf9 insect cells using 5FAM-RKRQGSVRRRVH-CO...
Ligand InfoPC cidPC sid
In DepthDetails ArticlePubMed
TargetInterleukin-1 receptor-associated kinase 4(Homo sapiens (Human))
Merck Research Laboratories
Curated by ChEMBL
LigandPNGBDBM294312(US9586948, Example 31)
Affinity DataIC50:  683nM. Assay description: Inhibition of human recombinant N-terminal GST-tagged full-length IRAK4 expressed in baculovirus infected Sf9 insect cells using 5FAM-RKRQGSVRRRVH-CO...
Ligand InfoPC cidPC sid
In DepthDetails ArticlePubMed