BDBM300642 6-(2-fluorophenyl)-N-[3-{[2-(8- oxa-3-azabicyclo[3.2.1]oct-3- yl)propanoyl]amino}-4- (trifluoromethoxy)phenyl] nicotinamide::US10130633, Example 212
SMILES CC(N1CC2CCC(C1)O2)C(=O)Nc1cc(NC(=O)c2ccc(nc2)-c2ccccc2F)ccc1OC(F)(F)F
InChI Key InChIKey=LMVNIXQGKHQJFM-UHFFFAOYSA-N
Data  2 IC50
  Tab Delimited (TSV)   2D SDfile   Computed 3D by Vconf -m prep SDfile
Find this compound or compounds like it in BindingDB:
Activity Spreadsheet -- Enzyme Inhibition Constant Data from BindingDB
Found 2 hits for monomerid = 300642
TargetProtein Wnt-3a(Homo sapiens (Human))
Bayer Pharma Aktiengesellschaft
US Patent
LigandPNGBDBM300642(6-(2-fluorophenyl)-N-[3-{[2-(8- oxa-3-azabicyclo[3...)
Affinity DataIC50: >5.00E+4nM. Assay description: In preparation of the assay, the two cell lines were plated 24 hours before at 10000 cells per well of a 384 micro titre plate (MTP) in 30 μL gr...
Ligand InfoPC cidPC sid
In DepthDetails US Patent
TargetProtein Wnt-3a(Homo sapiens (Human))
Bayer Pharma Aktiengesellschaft
US Patent
LigandPNGBDBM300642(6-(2-fluorophenyl)-N-[3-{[2-(8- oxa-3-azabicyclo[3...)
Affinity DataIC50:  180nM. Assay description: In preparation of the assay, the two cell lines were plated 24 hours before at 10000 cells per well of a 384 micro titre plate (MTP) in 30 μL gr...
Ligand InfoPC cidPC sid
In DepthDetails US Patent