BDBM30921 MLS000063277::N-(5-isobutyl-1,3,4-thiadiazol-2-yl)-2-(1H-1,2,4-triazol-5-ylthio)acetamide::N-(5-isobutyl-1,3,4-thiadiazol-2-yl)-2-(4H-1,2,4-triazol-3-ylthio)acetamide::N-[5-(2-methylpropyl)-1,3,4-thiadiazol-2-yl]-2-(1H-1,2,4-triazol-5-ylsulfanyl)acetamide::N-[5-(2-methylpropyl)-1,3,4-thiadiazol-2-yl]-2-(1H-1,2,4-triazol-5-ylsulfanyl)ethanamide::N-[5-(2-methylpropyl)-1,3,4-thiadiazol-2-yl]-2-(1H-1,2,4-triazol-5-ylthio)acetamide::SMR000074888::cid_975703
SMILES CC(C)Cc1nnc(NC(=O)CSc2nnc[nH]2)s1
InChI Key InChIKey=DZRIGSFJOINZNY-UHFFFAOYSA-N
Data  2 EC50
  Tab Delimited (TSV)   2D SDfile   Computed 3D by Vconf -m prep SDfile
Find this compound or compounds like it in BindingDB:
Activity Spreadsheet -- Enzyme Inhibition Constant Data from BindingDB
Found 2 hits for monomerid = 30921
TargetMultidrug resistance-associated protein 1(Homo sapiens (Human))
Srmlsc
Curated by PubChem BioAssay
LigandPNGBDBM30921(MLS000063277 | N-(5-isobutyl-1,3,4-thiadiazol-2-yl...)
Affinity DataEC50:  4.87E+3nM. Assay description: Southern Research Molecular Libraries Screening Center (SRMLSC) Southern Research Institute (Birmingham, Alabama) NIH Molecular Libraries Screening C...
In DepthDetails PCBioAssay
Target5-hydroxytryptamine receptor 1A(Homo sapiens (Human))
The Scripps Research Institute Molecular Screening Center
Curated by PubChem BioAssay
LigandPNGBDBM30921(MLS000063277 | N-(5-isobutyl-1,3,4-thiadiazol-2-yl...)
Affinity DataEC50:  9.90E+4nMpH: 7.4 T: 2°C. Assay description: A cell line containing the human 5-HT1a receptor, the promiscuous G-alpha-15 protein (Ga15) as well as the beta-lactamase (BLA) reporter-gene under c...
In DepthDetails PCBioAssay