BDBM309285 N-{((3R,4S)-1-[(1-methyl-1H-imidazol-4-yl)sulfonyl]-4-phenylpyrrolidin-3-yl}trifluoroethoxy)pyridin-2-amine::US9656955, Example 809
SMILES Cn1cnc(c1)S(=O)(=O)N1C[C@H](C(ONc2ccccn2)C(F)(F)F)[C@H](C1)c1ccccc1
InChI Key InChIKey=XBKLSVRRVMMFRK-LIHHCBPRSA-N
Data  1 KI
  Tab Delimited (TSV)   2D SDfile   Computed 3D by Vconf -m prep SDfile
Find this compound or compounds like it in BindingDB:
Activity Spreadsheet -- Enzyme Inhibition Constant Data from BindingDB
Found 1 hit for monomerid = 309285
LigandPNGBDBM309285(N-{((3R,4S)-1-[(1-methyl-1H-imidazol-4-yl)sulfonyl...)
Affinity DataKi: <10nM. Assay description: Radioligand binding assays using recombinant CHO cell membranes expressing human GlyT1: Radioligand binding to human GlyT1c transporter-expressing me...
Ligand InfoPC cidPC sid
In DepthDetails US Patent