BDBM316764 2-[(1-acryloylpiperidin-4-yl)amino]-N-(3,3-difluorocyclopentyl)-5H-pyrrolo[2,3-b]pyrazine-7-carboxamide::US11111242, Example 259::US9617258, Example 259
SMILES FC1(F)CCC(C1)NC(=O)c1c[nH]c2ncc(NC3CCN(CC3)C(=O)C=C)nc12
InChI Key
Data  4 IC50
  Tab Delimited (TSV)   2D SDfile   Computed 3D by Vconf -m prep SDfile
Find this compound or compounds like it in BindingDB:
Activity Spreadsheet -- Enzyme Inhibition Constant Data from BindingDB
Found 4 hits for monomerid = 316764
TargetTyrosine-protein kinase JAK3(Homo sapiens (Human))
Pfizer
US Patent
LigandPNGBDBM316764(2-[(1-acryloylpiperidin-4-yl)amino]-N-(3,3-difluor...)
Affinity DataIC50:  0.200nM. Assay description: Test article was solubilized in dimethyl sulfoxide (DMSO) to a stock concentration of 30 mM. An 11-point half log dilution series was created in DMSO...
Ligand InfoPC cidPC sid
In DepthDetails US Patent
TargetTyrosine-protein kinase JAK3(Homo sapiens (Human))
Pfizer
US Patent
LigandPNGBDBM316764(2-[(1-acryloylpiperidin-4-yl)amino]-N-(3,3-difluor...)
Affinity DataIC50:  11.1nM. Assay description: JAK Caliper Enzyme Assay at 1 mM ATP: Test article was solubilized in dimethyl sulfoxide (DMSO) to a stock concentration of 30 mM. An 11-point half l...
Ligand InfoPC cidPC sid
In DepthDetails US Patent
TargetTyrosine-protein kinase JAK3(Homo sapiens (Human))
Pfizer
US Patent
LigandPNGBDBM316764(2-[(1-acryloylpiperidin-4-yl)amino]-N-(3,3-difluor...)
Affinity DataIC50:  0.200nM. Assay description: JAK Caliper Enzyme Assay at 4 μM: Test article was solubilized in dimethyl sulfoxide (DMSO) to a stock concentration of 30 mM. An 11-point half ...
Ligand InfoPC cidPC sid
In DepthDetails US Patent
TargetTyrosine-protein kinase JAK3(Homo sapiens (Human))
Pfizer
US Patent
LigandPNGBDBM316764(2-[(1-acryloylpiperidin-4-yl)amino]-N-(3,3-difluor...)
Affinity DataIC50:  11.1nM. Assay description: Test article was solubilized in dimethyl sulfoxide (DMSO) to a stock concentration of 30 mM. An 11-point half log dilution series was created in DMSO...
Ligand InfoPC cidPC sid
In DepthDetails US Patent