BDBM326135 US10273223, Compound D-33::US9637472, Compound D-33
SMILES Cc1cc(C)c(CNC(=O)c2cc(Br)cc3n(ncc23)C2CCN(C2)C(=O)C(C)(C)C)c(=O)[nH]1
InChI Key
Data  2 IC50
  Tab Delimited (TSV)   2D SDfile   Computed 3D by Vconf -m prep SDfile
Find this compound or compounds like it in BindingDB:
Activity Spreadsheet -- Enzyme Inhibition Constant Data from BindingDB
Found 2 hits for monomerid = 326135
TargetHistone-lysine N-methyltransferase EZH2(Homo sapiens (Human))
Epizyme
US Patent
LigandPNGBDBM326135(US10273223, Compound D-33 | US9637472, Compound D-...)
Affinity DataIC50: <300nM. Assay description: eneral Procedure for Wild-Type PRC2 Enzyme Assay on Oligonucleosome Substrate. The assays was performed in a buffer consisting of 20 mM bicine (pH=7....
Ligand InfoPC cidPC sid
In DepthDetails US Patent
TargetHistone-lysine N-methyltransferase EZH2(Homo sapiens (Human))
Epizyme
US Patent
LigandPNGBDBM326135(US10273223, Compound D-33 | US9637472, Compound D-...)
Affinity DataIC50: <300nM. Assay description: Recombinant PRC2 Enzymes. Human PRC2 enzymes were purified as 4-component enzyme complexes co-expressed in Spodoptera frugiperda (sf9) cells using a ...
Ligand InfoPC cidPC sid
In DepthDetails US Patent