BDBM35103 biarylether amide quinoline, 4c
SMILES CC(C)NC(=O)c1cccc(Oc2cccc(c2)-c2c(Cc3ccccc3)cnc3c(cccc23)C(F)(F)F)c1
InChI Key InChIKey=UAHUOJIWTDTEMT-UHFFFAOYSA-N
Data  2 IC50
  Tab Delimited (TSV)   2D SDfile   Computed 3D by Vconf -m prep SDfile
Find this compound or compounds like it in BindingDB:
Activity Spreadsheet -- Enzyme Inhibition Constant Data from BindingDB
Found 2 hits for monomerid = 35103
TargetOxysterols receptor LXR-alpha [197-447](Homo sapiens (Human))
Wyeth Research
LigandPNGBDBM35103(biarylether amide quinoline, 4c)
Affinity DataIC50:  74nM. Assay description: Binding reaction was initiated by adding a dilution series of test compound in tracer solution to LXR-coated flash plates. Each concentration of test...
In DepthDetails ArticlePubMed
TargetOxysterols receptor LXR-beta [154-461](Homo sapiens (Human))
Wyeth Research
LigandPNGBDBM35103(biarylether amide quinoline, 4c)
Affinity DataIC50:  10nMpH: 7.4 T: 2°C. Assay description: Binding reaction was initiated by adding a dilution series of test compound in tracer solution to LXR-coated flash plates. Each concentration of test...
In DepthDetails ArticlePubMed