BDBM356129 US9815846, Compound 129
SMILES Cn1ccc(n1)-c1cc(C(=O)Nc2cnc(Cc3nnc[nH]3)nc2-c2ccccc2)c(F)cc1C(F)(F)F
InChI Key InChIKey=MDGKFZLEMPAIIJ-UHFFFAOYSA-N
Data  1 IC50
  Tab Delimited (TSV)   2D SDfile   Computed 3D by Vconf -m prep SDfile
Find this compound or compounds like it in BindingDB:
Activity Spreadsheet -- Enzyme Inhibition Constant Data from BindingDB
Found 1 hit for monomerid = 356129
TargetHigh affinity nerve growth factor receptor(Homo sapiens (Human))
Merck Sharp & Dohme
US Patent
LigandPNGBDBM356129(US9815846, Compound 129)
Affinity DataIC50:  0.25nM. Assay description: TrkA functional activity was measured using a DiscoverX PathHunter assay. In this assay, U2OS cells express the human TrkA receptor as a fusion with ...
Ligand InfoPC cidPC sid
In DepthDetails US Patent