BDBM357926 US10214536, Compound 293
SMILES CN(C)CCCc1ccc2oc3nc(N)c(cc3c(=O)c2c1)C(O)=O
InChI Key InChIKey=UFHZMIKXSGTKFX-UHFFFAOYSA-N
Data  1 IC50
PDB links: 1 PDB ID matches this monomer.
  Tab Delimited (TSV)   2D SDfile   Computed 3D by Vconf -m prep SDfile
Find this compound or compounds like it in BindingDB:
Activity Spreadsheet -- Enzyme Inhibition Constant Data from BindingDB
Found 1 hit for monomerid = 357926
TargetSerine/threonine-protein kinase TBK1(Homo sapiens (Human))
The Regents of The University of Michigan
US Patent
LigandPNGBDBM357926(US10214536, Compound 293)
Affinity DataIC50:  3.76E+3nM. Assay description: Kinase assays are commonly used for determining the ability of a small molecule to inhibit enzyme activity. By measuring the degree of phosphorylatio...
Ligand InfoPC cidPC sidPDB