BDBM36478 6-Oxo-7,8,9,10-tetrahydrobenzo[c]chromen-3-yl benzoate::MAG-1
SMILES O=C(Oc1ccc2c3CCCCc3c(=O)oc2c1)c1ccccc1
InChI Key InChIKey=HDBDDEFTKCWERY-UHFFFAOYSA-N
Data  1 IC50
  Tab Delimited (TSV)   2D SDfile   Computed 3D by Vconf -m prep SDfile
Find this compound or compounds like it in BindingDB:
Activity Spreadsheet -- Enzyme Inhibition Constant Data from BindingDB
Found 1 hit for monomerid = 36478
TargetAmine oxidase [flavin-containing] B(Homo sapiens (Human))
Harvard Medical School
LigandPNGBDBM36478(6-Oxo-7,8,9,10-tetrahydrobenzo[c]chromen-3-yl benz...)
Affinity DataIC50:  1nM. Assay description: Momoamine oxidase type B(MAO-B) activity in vitro assay using molecules that caused a photomotor response (PMR) "magnitude stimulant' (MAG) pheno...
In DepthDetails ArticlePubMed