BDBM376119 N-(2-(dimethylamino)ethyl)-3-(2-(4-(4-ethoxy-6-oxo-1,6-dihydropyridin-3-yl)-2-fluorophenyl)acetamido)-5-(trifluoromethyl)benzamide::US9918974, Example 1
SMILES CCOc1cc(=O)ncc1-c1ccc(CC(=O)Nc2cc(cc(c2)C(F)(F)F)C(=O)NCCN(C)C)c(F)c1
InChI Key
Data  1 IC50
  Tab Delimited (TSV)   2D SDfile   Computed 3D by Vconf -m prep SDfile
Find this compound or compounds like it in BindingDB:
Activity Spreadsheet -- Enzyme Inhibition Constant Data from BindingDB
Found 1 hit for monomerid = 376119
TargetProto-oncogene tyrosine-protein kinase receptor Ret [658-1114](Homo sapiens (Human))
Glaxosmithkline
US Patent
LigandPNGBDBM376119(N-(2-(dimethylamino)ethyl)-3-(2-(4-(4-ethoxy-6-oxo...)
Affinity DataIC50: <10nM. Assay description: Human RET kinase cytoplasmic domain (amino acids 658-1114 of accession number NP_000314.1) was expressed as an N-terminal GST-fusion protein using a ...
Ligand InfoPC cidPC sid
In DepthDetails US Patent