BDBM4044 1,3-dihydro-1-methyl-N-phenyl-2-thioxo-2H-pyrrolo[2,3-b]pyridine-3-carboxamide::1-methyl-N-phenyl-2-sulfanylidene-1H,2H,3H-pyrrolo[2,3-b]pyridine-3-carboxamide::2-thioxo-1H-indole-3-carboxamide deriv. 9z
SMILES CN1C(=S)C(C(=O)Nc2ccccc2)c2cccnc12
InChI Key InChIKey=XSWFYMGWWIUBBO-UHFFFAOYSA-N
Data  2 IC50
  Tab Delimited (TSV)   2D SDfile   Computed 3D by Vconf -m prep SDfile
Find this compound or compounds like it in BindingDB:
Activity Spreadsheet -- Enzyme Inhibition Constant Data from BindingDB
Found 2 hits for monomerid = 4044
TargetTyrosine-protein kinase transforming protein Src(Avian sarcoma virus)
University of Auckland
LigandPNGBDBM4044(1,3-dihydro-1-methyl-N-phenyl-2-thioxo-2H-pyrrolo[...)
Affinity DataIC50:  3.07E+4nM. Assay description: IC50 is the inhibitor concentration which inhibits 50% of kinase activity that catalyzes the transfer of the terminal phosphate from [gamma-32P] labe...
Ligand InfoPC cidPC sid
In DepthDetails ArticlePubMed
TargetEpidermal growth factor receptor(Homo sapiens (Human))
University of Auckland
LigandPNGBDBM4044(1,3-dihydro-1-methyl-N-phenyl-2-thioxo-2H-pyrrolo[...)
Affinity DataIC50: >1.00E+5nM. Assay description: IC50 is the inhibitor concentration which inhibits 50% of kinase activity that catalyzes the transfer of the terminal phosphate from [gamma-32P] labe...
Ligand InfoPC cidPC sid
In DepthDetails ArticlePubMed