BDBM4156 (2S,4S)-N-tert-butyl-4-chloro-1-[(2S,3S)-2-hydroxy-3-[(3-hydroxy-2,4-dimethylphenyl)formamido]-4-(4-methylphenyl)butanoyl]pyrrolidine-2-carboxamide::(3-Hydroxy-2,4-dimethylbenzoyl)-(2(S)-hydroxy-3(S)-amino-4-p-tolylbutanoyl)-4(S)-Cl-Pro-NH-t-Bu::AHPBA deriv. 41::CHEMBL117024
SMILES Cc1ccc(C[C@H](NC(=O)c2ccc(C)c(O)c2C)[C@H](O)C(=O)N2C[C@@H](Cl)C[C@H]2C(=O)NC(C)(C)C)cc1
InChI Key InChIKey=APUQDJYVNAUUPK-IVIIFCHOSA-N
Data  2 IC50
  Tab Delimited (TSV)   2D SDfile   Computed 3D by Vconf -m prep SDfile
Find this compound or compounds like it in BindingDB:
Activity Spreadsheet -- Enzyme Inhibition Constant Data from BindingDB
Found 2 hits for monomerid = 4156
TargetGag-Pol polyprotein [489-587](Human immunodeficiency virus type 1)
Chinese Academy Of Sciences
Curated by ChEMBL
LigandPNGBDBM4156((2S,4S)-N-tert-butyl-4-chloro-1-[(2S,3S)-2-hydroxy...)
Affinity DataIC50:  8.60nM. Assay description: Inhibitory activity against HIV-1 protease
In DepthDetails ArticlePubMed
TargetDimer of Gag-Pol polyprotein [489-587](Human immunodeficiency virus type 1)
Sankyo
LigandPNGBDBM4156((2S,4S)-N-tert-butyl-4-chloro-1-[(2S,3S)-2-hydroxy...)
Affinity DataIC50:  8.60nM. Assay description: The inhibitory activities of the compounds toward HIV-1 PR were determined by sodium dodecyl sulfate-polyacrylamide gel electrophoresis (SDS-PAGE) as...
In DepthDetails ArticlePubMed