BDBM433499 US10562853, Compound 16
SMILES Fc1ccc(cc1Cl)C(=O)N1CCC(F)(CNCCOc2cccc3cccnc23)CC1
InChI Key InChIKey=GQUKVOGAZWDTMK-UHFFFAOYSA-N
Data  6 KI  4 EC50
  Tab Delimited (TSV)   2D SDfile   Computed 3D by Vconf -m prep SDfile
Find this compound or compounds like it in BindingDB:
Activity Spreadsheet -- Enzyme Inhibition Constant Data from BindingDB
Found 10 hits for monomerid = 433499
Target5-hydroxytryptamine receptor 1A(Homo sapiens (Human))
Jagiellonian University Medical College
Curated by ChEMBL
LigandPNGBDBM433499(US10562853, Compound 16)
Affinity DataKi:  0.0603nM. Assay description: Displacement of [3H]8-OH-DPAT from human 5-HT1A receptor stably expressed in CHO-K1 cell membranes measured after 60 mins by Microbeta2 scintillation...
Ligand InfoPC cidPC sid
In DepthDetails PubMed
Target5-hydroxytryptamine receptor 1A(Homo sapiens (Human))
Jagiellonian University Medical College
Curated by ChEMBL
LigandPNGBDBM433499(US10562853, Compound 16)
Affinity DataKi:  0.150nM. Assay description: 5-HT1A: Radioligand binding was performed using membranes from CHO-K1 cells stably transfected with the human 5-HT1A receptor. All assays were carrie...
Ligand InfoPC cidPC sid
In DepthDetails US Patent
TargetAlpha-1A adrenergic receptor(Homo sapiens (Human))
Neurolixis
US Patent
LigandPNGBDBM433499(US10562853, Compound 16)
Affinity DataKi:  170nM. Assay description: Alpha1-adrenergic Receptor: Radioligand binding was performed using tissue (rat cortex). All assays were carried out in duplicates. 50 μL workin...
Ligand InfoPC cidPC sid
In DepthDetails US Patent
TargetAlpha-1A/Alpha-1B/Alpha-1D adrenergic receptor(Rattus norvegicus (rat))
Jagiellonian University Medical College
Curated by ChEMBL
LigandPNGBDBM433499(US10562853, Compound 16)
Affinity DataKi:  174nM. Assay description: Displacement of [3H]prazosin from alpha1 adrenergic receptor in rat cortex membranes measured after 30 mins by Microbeta2 scintillation counting meth...
Ligand InfoPC cidPC sid
In DepthDetails PubMed
TargetD(2) dopamine receptor(Homo sapiens (Human))
Jagiellonian University Medical College
Curated by ChEMBL
LigandPNGBDBM433499(US10562853, Compound 16)
Affinity DataKi: <1.00E+3nM. Assay description: Displacement of [3H]methylspiperone from human D2 receptor stably expressed in CHO-K1 cell membranes measured after 60 mins by Microbeta2 scintillati...
Ligand InfoPC cidPC sid
In DepthDetails PubMed
TargetD(2) dopamine receptor(Homo sapiens (Human))
Jagiellonian University Medical College
Curated by ChEMBL
LigandPNGBDBM433499(US10562853, Compound 16)
Affinity DataKi: >1.00E+3nM. Assay description: D2 Dopamine Receptor:Radioligand binding was performed using membranes from CHO-K1 cells stably transfected with the human D2 receptor. All assays we...
Ligand InfoPC cidPC sid
In DepthDetails US Patent
Target5-hydroxytryptamine receptor 1A(Homo sapiens (Human))
Jagiellonian University Medical College
Curated by ChEMBL
LigandPNGBDBM433499(US10562853, Compound 16)
Affinity DataEC50:  13nM. Assay description: Biased agonist activity at human 5-HT1A receptor stably expressed in CHO-K1 cells co-expressing Galpha16/GPCR assessed as increase in calcium mobiliz...
Ligand InfoPC cidPC sid
In DepthDetails PubMed
Target5-hydroxytryptamine receptor 1A(Homo sapiens (Human))
Jagiellonian University Medical College
Curated by ChEMBL
LigandPNGBDBM433499(US10562853, Compound 16)
Affinity DataEC50:  0.501nM. Assay description: Biased agonist activity at human 5-HT1A receptor stably expressed in CHO-K1 cells assessed as increase in ERK1/2 phosphorylation after 15 mins by Alp...
Ligand InfoPC cidPC sid
In DepthDetails PubMed
Target5-hydroxytryptamine receptor 1A(Homo sapiens (Human))
Jagiellonian University Medical College
Curated by ChEMBL
LigandPNGBDBM433499(US10562853, Compound 16)
Affinity DataEC50:  0.339nM. Assay description: Biased agonist activity at human 5-HT1A receptor stably expressed in CHO-K1 cells assessed as inhibition of forskolin-induced cAMP accumulation after...
Ligand InfoPC cidPC sid
In DepthDetails PubMed
Target5-hydroxytryptamine receptor 1A(Homo sapiens (Human))
Jagiellonian University Medical College
Curated by ChEMBL
LigandPNGBDBM433499(US10562853, Compound 16)
Affinity DataEC50:  0.00148nM. Assay description: Biased agonist activity at Gal4-VP16 transcription factor linked human 5-HT1A receptor expressed in human U2OS cells assessed as induction of beta-ar...
Ligand InfoPC cidPC sid
In DepthDetails PubMed