BDBM435794 US10577373, Compound I-954
SMILES CNc1cc(Nc2cccn(-c3ncccc3F)c2=O)nc2c(cnn12)C(=O)N[C@@H]1C[C@@H]1F
InChI Key InChIKey=FFJRAFFUQOURPS-DZGCQCFKSA-N
Data  1 Kd
PDB links: 1 PDB ID matches this monomer.
  Tab Delimited (TSV)   2D SDfile   Computed 3D by Vconf -m prep SDfile
Find this compound or compounds like it in BindingDB:
Activity Spreadsheet -- Enzyme Inhibition Constant Data from BindingDB
Found 1 hit for monomerid = 435794
TargetNon-receptor tyrosine-protein kinase TYK2 [556-888](Homo sapiens (Human))
Nimbus Lakshimi
US Patent
LigandPNGBDBM435794(US10577373, Compound I-954)
Affinity DataKd: <0.200nM. Assay description: Binding constants for compounds of the present invention against the JH2 domain were determined by the following protocol for a KINOMEscan® assay (Di...
Ligand InfoPC cidPC sidPDB