BDBM44009 7-[[5-(4-ethylanilino)-1,3,4-thiadiazol-2-yl]sulfanylmethyl]-[1,3]thiazolo[3,2-a]pyrimidin-5-one::7-[[5-[(4-ethylphenyl)amino]-1,3,4-thiadiazol-2-yl]sulfanylmethyl]-[1,3]thiazolo[3,2-a]pyrimidin-5-one::7-[[[5-(4-ethylanilino)-1,3,4-thiadiazol-2-yl]thio]methyl]-5-thiazolo[3,2-a]pyrimidinone::7-[[[5-(4-ethylanilino)-1,3,4-thiadiazol-2-yl]thio]methyl]thiazolo[3,2-a]pyrimidin-5-one::MLS000566282::SMR000153421::cid_2581531
SMILES CCc1ccc(Nc2nnc(SCc3cc(=O)n4ccsc4n3)s2)cc1
InChI Key InChIKey=IELBCLFXWWPKBY-UHFFFAOYSA-N
Data  3 EC50
  Tab Delimited (TSV)   2D SDfile   Computed 3D by Vconf -m prep SDfile
Find this compound or compounds like it in BindingDB:
Activity Spreadsheet -- Enzyme Inhibition Constant Data from BindingDB
Found 3 hits for monomerid = 44009
TargetSolute carrier family 12 member 5(Homo sapiens (Human))
Vanderbilt Screening Center For Gpcrs, Ion Channels and Transporters
Curated by PubChem BioAssay
LigandPNGBDBM44009(7-[[5-(4-ethylanilino)-1,3,4-thiadiazol-2-yl]sulfa...)
Affinity DataEC50:  281nM. Assay description: Vanderbilt Screening Center for GPCRs, Ion Channels and Transporters Assay Provider: Eric Delpire Assay Provider Affliation: Vanderbilt University Gr...
In DepthDetails PCBioAssay
TargetSolute carrier family 12 member 5(Homo sapiens (Human))
Vanderbilt Screening Center For Gpcrs, Ion Channels and Transporters
Curated by PubChem BioAssay
LigandPNGBDBM44009(7-[[5-(4-ethylanilino)-1,3,4-thiadiazol-2-yl]sulfa...)
Affinity DataEC50:  113nM. Assay description: Vanderbilt Screening Center for GPCRs, Ion Channels and Transporters Assay Provider: Eric Delpire Assay Provider Affliation: Vanderbilt University Gr...
In DepthDetails PCBioAssay
TargetSolute carrier family 12 member 5(Homo sapiens (Human))
Vanderbilt Screening Center For Gpcrs, Ion Channels and Transporters
Curated by PubChem BioAssay
LigandPNGBDBM44009(7-[[5-(4-ethylanilino)-1,3,4-thiadiazol-2-yl]sulfa...)
Affinity DataEC50:  202nM. Assay description: Vanderbilt Screening Center for GPCRs, Ion Channels and Transporters Assay Provider: Eric Delpire Assay Provider Affliation: Vanderbilt University Gr...
In DepthDetails PCBioAssay