BDBM4505 3-quinolinecarbonitrile deriv. 2j::4-[(2,4-Dichlorophenyl)amino]-6,7-di-n-butoxy-3-quinolinecarbonitrile::6,7-dibutoxy-4-[(2,4-dichlorophenyl)amino]quinoline-3-carbonitrile
SMILES CCCCOc1cc2ncc(C#N)c(Nc3ccc(Cl)cc3Cl)c2cc1OCCCC
InChI Key InChIKey=ULXKBWTVVRXWRA-UHFFFAOYSA-N
Data  1 IC50
  Tab Delimited (TSV)   2D SDfile   Computed 3D by Vconf -m prep SDfile
Find this compound or compounds like it in BindingDB:
Activity Spreadsheet -- Enzyme Inhibition Constant Data from BindingDB
Found 1 hit for monomerid = 4505
TargetProto-oncogene tyrosine-protein kinase Src(Homo sapiens (Human))
Wyeth-Ayerst Research
LigandPNGBDBM4505(3-quinolinecarbonitrile deriv. 2j | 4-[(2,4-Dichlo...)
Affinity DataIC50:  160nMpH: 7.5 T: 2°C. Assay description: Src kinase activity was measured in an ELISA format. IC50 is the inhibitor concentration which inhibits 50% of kinase activity that catalyzes the tra...
In DepthDetails ArticlePubMed