BDBM4595 4-anilinoquinazoline deriv. 17::6-Substituted 4-Anilinoquinazoline 9::N-{4-[(3-bromophenyl)amino]quinazolin-6-yl}-2-methylprop-2-enamide
SMILES CC(=C)C(=O)Nc1ccc2ncnc(Nc3cccc(Br)c3)c2c1
InChI Key InChIKey=YBGIIBLAQDXGRC-UHFFFAOYSA-N
Data  3 IC50
  Tab Delimited (TSV)   2D SDfile   Computed 3D by Vconf -m prep SDfile
Find this compound or compounds like it in BindingDB:
Activity Spreadsheet -- Enzyme Inhibition Constant Data from BindingDB
Found 3 hits for monomerid = 4595
TargetEpidermal growth factor receptor(Homo sapiens (Human))
Wyeth-Ayerst Research
LigandPNGBDBM4595(4-anilinoquinazoline deriv. 17 | 6-Substituted 4-A...)
Affinity DataIC50:  339nM. Assay description: The EGF-R kinase autophosphorylation activity was measured by DELFIA/time-resolved fluorometry with excitation at 340 nm and emission at 615 nm. Po...
In DepthDetails ArticlePubMed
TargetEpidermal growth factor receptor(Homo sapiens (Human))
Wyeth-Ayerst Research
LigandPNGBDBM4595(4-anilinoquinazoline deriv. 17 | 6-Substituted 4-A...)
Affinity DataIC50:  1.20nMpH: 7.4 T: 2°C. Assay description: Enzyme assays for IC50 determinations were performed in 96-well filter plates. IC50 is the inhibitor concentration which inhibits 50% of kinase activ...
In DepthDetails ArticlePubMed
TargetReceptor tyrosine-protein kinase erbB-2(Homo sapiens (Human))
Wyeth-Ayerst Research
LigandPNGBDBM4595(4-anilinoquinazoline deriv. 17 | 6-Substituted 4-A...)
Affinity DataIC50:  1.52E+4nM. Assay description: The HER-2 kinase autophosphorylation activity was measured by DELFIA/time-resolved fluorometry with excitation at 340 nm and emission at 615 nm. Po...
In DepthDetails ArticlePubMed